{"text_format":"1","workbook":"xlsx","n_sheets":6,"sheets":["Basisgegevens","Formulier","Toelichting en definities","Gemeente codes","Normen","Historie"],"not_rendered":{"charts":0,"images":0,"macros":1,"external_links":0,"defined_names":13,"comments":1,"pivot_tables":0},"unopened":[],"bounds":{"document_bytes":16777216,"sheet_cells":100000,"rows_first":2000,"rows_last":500,"rows_between":2000,"halvings":0,"cell_chars":16384,"cell_head_chars":4096},"cells_cut":0,"cells_raw":0,"read":"whole","date_system":"1900"}

{"sheet":"Basisgegevens","index":0,"n_rows":36,"n_cols":5,"rows_kept":36,"cut":false,"hidden":false,"merged":[]}
[null,"v2.7.1-Ext"]
[]
[null,null,"Leerplichttelling"]
[]
[]
[]
[]
[]
[]
[]
[]
[null,"Gemeente",1,null,"*"]
[]
[null,"LAOV nummer",{"$f":"IF(ISERROR(VLOOKUP(C12,'Gemeente codes'!A3:B346,2,FALSE)),\"\",VLOOKUP(C12,'Gemeente codes'!A3:B346,2,FALSE))","v":""},null,"Wordt automatisch gevuld na keuze gemeente"]
[]
[null,"Invuldatum","2024-09-13T14:52:07",null,"*"]
[]
[null,null,"Het formulier bevat automatische koppelingen om het invullen"]
[null,null,"voor u zo gemakkelijk mogelijk te maken. Gelieve deze structuur"]
[null,null,"niet te veranderen."]
{"$rows_left_out":17}
{"sheet":"Formulier","index":1,"n_rows":51,"n_cols":32,"rows_kept":51,"cut":false,"hidden":false,"merged":[[47,2,47,3],[12,1,15,1],[12,4,12,6],[13,4,13,6],[14,2,15,2],[15,4,15,6],[14,4,14,6],[21,4,21,6],[28,1,31,1],[36,2,38,2],[26,1,27,1],[24,2,24,3],[12,2,13,2],[32,1,38,1],[32,2,35,2],[23,1,23,3],[1,1,1,7],[9,1,11,1],[9,4,9,6],[14,7,14,13],[10,4,10,6],[10,7,10,13],[11,4,11,6],[12,7,12,13],[9,7,9,13],[11,7,11,13],[6,4,6,6],[6,7,6,13],[7,1,8,1],[7,4,7,6],[7,7,7,13],[8,4,8,6],[20,4,20,6],[22,4,22,6],[19,4,19,6],[25,15,25,17],[16,1,18,1],[16,4,16,6],[17,4,17,6],[17,7,17,13],[18,7,18,13],[18,4,18,6],[16,7,16,13],[25,18,25,24],[8,7,8,13],[20,7,20,13],[13,7,13,13],[15,7,15,13],[22,7,22,13],[21,7,21,13],[19,7,19,13],[26,18,26,24],[27,15,27,17],[27,18,27,24],[26,15,26,17],[35,15,35,17],[29,18,29,24],[30,15,30,17],[30,18,30,24],[35,18,35,24],[28,18,28,24],[32,18,32,24],[29,15,29,17],[32,15,32,17],[28,15,28,17],[38,18,38,24],[36,18,36,24],[39,15,39,17],[36,15,36,17],[41,15,41,17],[41,18,41,24],[40,15,40,17],[40,18,40,24],[38,15,38,17],[42,15,42,17],[42,18,42,24],[43,15,43,17],[43,18,43,24],[44,15,44,17],[44,18,44,24],[45,15,45,17],[45,18,45,24],[39,18,39,24],[48,15,48,17],[42,1,48,1],[47,15,47,17],[47,18,47,24],[39,2,41,2],[48,2,48,3],[42,2,42,3],[43,2,43,3],[44,2,44,3],[45,2,45,3],[46,2,46,3],[39,1,41,1],[48,18,48,24]]}
[null,"Opgave volgens artikel 25 Leerplichtwet"]
[null,"Betreft leer- en kwalificatieplichtigen: jongeren van 5 tot 18 jaar zonder startkwalificatie, ingeschreven in de BRP.",null,null,null,null,null,null,null,null,null,null,null,null,null,null,null,null,null,null,null,null,null,null,null," "]
[null,{"$f":"CONCATENATE(\"Schooljaar \",YEAR(NOW())-1,\"-\",YEAR(NOW()))","v":"Schooljaar 2023-2024"}]
[null,"Laov-nummer:",{"$f":"+Basisgegevens!C14","v":""},null,null,"Als een waarde onbekend is, gelieve de cel in te vullen met '9999'."]
[null,"Gemeentenaam:  ",{"$f":"IF(ISNA(VLOOKUP(C4,'Gemeente codes'!B3:C346,2,FALSE)),\"\",VLOOKUP(C4,'Gemeente codes'!B3:C346,2,FALSE))","v":""},null,null,"Als een waarde nul is '0' invullen."]
[null,null,null,null,"Aantal"]
[null,null,null,null,"Toelichting",null,null,"Definities"]
[null,"vervangende leerplicht","art. 3a"]
[null,null,"art. 3b"]
[null,"vrijstellingen","art. 5 onder a"]
[null,null,"art. 5 onder b"]
[null,null,"art. 5 onder c"]
[null,"Ongeoorloofd verzuim","absoluut","totaal"]
[null,null,null,"weer ingeschreven"]
[null,null,"relatief","totaal"]
[null,null,null,"waaronder luxe verzuim"]
[null,"processen verbaal","absoluut verzuim"]
[null,null,"relatief verzuim"]
[null,null,"artikel 13a"]
[null,"thuiszitters","per 1 sept"]
{"$rows_left_out":32}
{"sheet":"Toelichting en definities","index":2,"n_rows":31,"n_cols":8,"rows_kept":31,"cut":false,"hidden":false,"merged":[[4,0,6,0],[21,0,23,0],[24,0,30,0],[8,0,9,0],[18,0,20,0],[14,0,17,0]]}
[null,"In de eerste 4 kolommen vindt u de definitie van de gegevens en een toelichting. In de 1e invulbare kolom geeft u aan als er bij de huidige cijfers niet (helemaal)",null,null,null,null,null,{"$f":"Normen!B1","v":2023}]
[null,{"$f":"CONCATENATE(\"volgens de definitie is gewerkt. In de 2e invulbare kolom geeft u aan als de opgegeven cijfers over \",H1,\"-\",H2,\" niet volledig of juist zijn. Geef ook de reden op.\")","v":"volgens de definitie is gewerkt. In de 2e invulbare kolom geeft u aan als de opgegeven cijfers over 2023-2024 niet volledig of juist zijn. Geef ook de reden op."},null,null,null,null,null,{"$f":"Normen!C1","v":2024}]
[null,"Duo gebruikt de informatie om de resultaten van de telling toe te lichten en te begrijpen. Ook om toekomstige tellingen te verbeteren."]
["Onderdeel op formulier","naam op formulier","definitie bij naam op formulier","toelichting",{"$f":"CONCATENATE(\"in te vullen door gemeente: is er voor het huidige verslagjaar \",H1,\"-\",H2,\" gewerkt conform deze definitie en toelichting, zo nee: wat zijn de verschillen?  \")","v":"in te vullen door gemeente: is er voor het huidige verslagjaar 2023-2024 gewerkt conform deze definitie en toelichting, zo nee: wat zijn de verschillen?  "},{"$f":"CONCATENATE(\"in te vullen door de gemeente: zijn de opgegeven cijfers over het verslagjaar \",H1,\"-\",H2,\" volledig en juist. Zo nee, waarom niet?\")","v":"in te vullen door de gemeente: zijn de opgegeven cijfers over het verslagjaar 2023-2024 volledig en juist. Zo nee, waarom niet?"}]
["Algemeen","Het totaal aantal Leerplichtige jongeren (5 tot 16 jaar) en kwalificatieplichtige jongeren (16 tot 18 jaar) van de gemeente",{"$f":"CONCATENATE(\"Leerplichtige jongeren van 5 tot 16 jaar en kwalificatieplichtige jongeren van 16 tot 18 jaar. Het gaat om alle leer- en kwalificatieplichtige jongeren die op de peildatum 1 oktober \",H1,\" waren ingeschreven in de BRP.\")","v":"Leerplichtige jongeren van 5 tot 16 jaar en kwalificatieplichtige jongeren van 16 tot 18 jaar. Het gaat om alle leer- en kwalificatieplichtige jongeren die op de peildatum 1 oktober 2023 waren ingeschreven in de BRP."},"Jongeren zijn leerplichtig vanaf 5 jaar. Ze blijven dit tot het einde van het schooljaar in het 16e levensjaar. Daarna zijn leerlingen kwalificatieplichtig tot de dag dat ze 18 worden of als ze een startkwalificatie hebben behaald. Dat is een havo- of vwo-diploma, of een mbo-diploma op ten minste niveau 2. \n\nDe kwalificatieplicht geldt niet voor jongeren die een getuigschrift of een schooldiploma praktijkonderwijs hebben. Kwalificatieplicht geldt ook niet voor jongeren die voortgezet speciaal onderwijs in het arbeidsmarktgerichte uitstroomprofiel of het uitstroomprofiel dagbesteding hebben gevolgd. Het gaat alleen om jongeren die zijn ingeschreven in de BRP."]
[null,"Onderwijs onbekend","De leerling volgt, of volgde, wel onderwijs maar de onderwijssoort is niet bekend (alleen bij uitzondering invullen).\n\n"]
[null,"Geen onderwijs ","De jongere heeft nog geen onderwijs gevolgd. \n\n"]
["Specificering","Specificatie naar laatst genoten onderwijs","Leerplichtige jongeren van 5 tot 16 jaar en kwalificatieplichtige jongeren van 16 tot 18 jaar gespecificeerd naar laatst genoten onderwijs. ","De verdeling van het totale opgegeven aantal van de doelgroep naar laatst gevolgde onderwijs. Als iedereen in de groep is ingedeeld, komt het ongespecificeerde aantal op nul uit. Wat ongespecificeerd is, telt mee met ‘onderwijs onbekend’."]
["Vervangende leerplicht ","Vervangende leerplicht artikel 3a","Het aantal jongeren van 14 of 15 jaar dat ingeschreven is in het vo/vso waarvoor de gemeente voor het schooljaar vervangende leerplicht in de vorm van een duaal programma heeft goedgekeurd.\n\n\n\n\n",{"$f":"CONCATENATE(\"Geldt voor jongeren van 14 of 15 jaar. De leerplichtambtenaar doet eerst onderzoek om de jongere toch onderwijs te laten volgen. \",\"Lukt dit niet? Dan kan de gemeente bepalen dat de jongere een duaal programma kan volgen. Een duaal programma is een bijzonder onderwijsprogramma dat algemene vorming en werkervaring combineert. \",\"De jongere blijft dan ingeschreven aan een school voor de 1e fase voortgezet onderwijs of (voortgezet)speciaal onderwijs. Tel alle jongeren mee voor wie de gemeente vervangende leerplicht voor schooljaar \",H1,\"-\",H2, \" heeft goedgekeurd. Tel ook de jongeren mee die niet meer in de gemeente wonen.\")","v":"Geldt voor jongeren van 14 of 15 jaar. De leerplichtambtenaar doet eerst onderzoek om de jongere toch onderwijs te laten volgen. Lukt dit niet? Dan kan de gemeente bepalen dat de jongere een duaal programma kan volgen. Een duaal programma is een bijzonder onderwijsprogramma dat algemene vorming en werkervaring combineert. De jongere blijft dan ingeschreven aan een school voor de 1e fase voortgezet onderwijs of (voortgezet)speciaal onderwijs. Tel alle jongeren mee voor wie de gemeente vervangende leerplicht voor schooljaar 2023-2024 heeft goedgekeurd. Tel ook de jongeren mee die niet meer in de gemeente wonen."}]
[null,"Vervangende leerplicht artikel 3b","Het aantal jongeren in het laatste schooljaar van de volledige leerplicht waarvoor de gemeente voor het schooljaar vervangende leerplicht in de vorm van een duaal programma heeft goedgekeurd.\n\n\n",{"$f":"CONCATENATE(\"De jongere staat ingeschreven bij een school of instelling die 1 van deze soorten aanbiedt:\n- volledig dagonderwijs\n- een bij wet geregelde combinatie van leren en werken\",\"\n- een onderwijsprogramma, zoals bepaald in artikel 25a, lid 3, onderdeel d, van de Wet op het vo (samenwerking vo en mbo) \n- een onderwijsprogramma, zoals bepaald in artikel 58a, lid 3, onderdeel d, van de Wet op het vo (vavo)\",\"\nTel alle jongeren mee voor wie de gemeente vervangende leerplicht voor het schooljaar \",H1,\"-\",H2,\" heeft goedgekeurd. Tel ook de jongeren mee die niet meer in de gemeente wonen.\")","v":"De jongere staat ingeschreven bij een school of instelling die 1 van deze soorten aanbiedt:\n- volledig dagonderwijs\n- een bij wet geregelde combinatie van leren en werken\n- een onderwijsprogramma, zoals bepaald in artikel 25a, lid 3, onderdeel d, van de Wet op het vo (samenwerking vo en mbo) \n- een onderwijsprogramma, zoals bepaald in artikel 58a, lid 3, onderdeel d, van de Wet op het vo (vavo)\nTel alle jongeren mee voor wie de gemeente vervangende leerplicht voor het schooljaar 2023-2024 heeft goedgekeurd. Tel ook de jongeren mee die niet meer in de gemeente wonen."}]
["Vrijstellingen","Vrijstellingen artikel 5 onder a","Het aantal jongeren met een vrijstelling omdat zij op lichamelijke of psychische gronden ongeschikt zijn om op een school te worden ingeschreven.\n\n",{"$f":"CONCATENATE(\"Vul de aantallen in en ga uit van het laatst genoten onderwijs. Degenen die nog geen onderwijs volgden vallen onder 'geen onderwijs'. \nDe gemeente telt alle jongeren:\n- die op 1 augustus \", H1, \" in hun gemeente woonden én een vrijstelling hadden\n- waar de gemeente na die datum een vrijstelling voor heeft afgegeven voor schooljaar \",H1,\"-\",H2)","v":"Vul de aantallen in en ga uit van het laatst genoten onderwijs. Degenen die nog geen onderwijs volgden vallen onder 'geen onderwijs'. \nDe gemeente telt alle jongeren:\n- die op 1 augustus 2023 in hun gemeente woonden én een vrijstelling hadden\n- waar de gemeente na die datum een vrijstelling voor heeft afgegeven voor schooljaar 2023-2024"}]
[null,"Vrijstellingen artikel 5 onder b","Het aantal jongeren met een vrijstelling op grond van bezwaren tegen de richting van de scholen binnen redelijke afstand van de woning.\n\n",{"$f":"CONCATENATE(\"Vul de aantallen in en ga uit van het laatst genoten onderwijs. Degenen die nog geen onderwijs volgden vallen onder 'geen onderwijs'. \nDe gemeente telt alle jongeren:\n- die op 1 augustus \", H1, \" in hun gemeente woonden én een vrijstelling hadden\n- waar de gemeente na die datum een vrijstelling voor heeft afgegeven voor schooljaar \",H1,\"-\",H2)","v":"Vul de aantallen in en ga uit van het laatst genoten onderwijs. Degenen die nog geen onderwijs volgden vallen onder 'geen onderwijs'. \nDe gemeente telt alle jongeren:\n- die op 1 augustus 2023 in hun gemeente woonden én een vrijstelling hadden\n- waar de gemeente na die datum een vrijstelling voor heeft afgegeven voor schooljaar 2023-2024"}]
[null,"Vrijstellingen artikel 5 onder c","Het aantal jongeren met een vrijstelling op grond van het ingeschreven zijn bij een onderwijsinstelling buiten Nederland en het geregeld bezoeken daarvan.\n\n",{"$f":"CONCATENATE(\"Vul de aantallen in en ga uit van het laatst genoten onderwijs. Degenen die nog geen onderwijs volgden vallen onder 'geen onderwijs'. \nDe gemeente telt alle jongeren:\n- die op 1 augustus \", H1, \" in hun gemeente woonden én een vrijstelling hadden\n- waar de gemeente na die datum een vrijstelling voor heeft afgegeven voor schooljaar \",H1,\"-\",H2)","v":"Vul de aantallen in en ga uit van het laatst genoten onderwijs. Degenen die nog geen onderwijs volgden vallen onder 'geen onderwijs'. \nDe gemeente telt alle jongeren:\n- die op 1 augustus 2023 in hun gemeente woonden én een vrijstelling hadden\n- waar de gemeente na die datum een vrijstelling voor heeft afgegeven voor schooljaar 2023-2024"}]
[null,"Vrijstellingen artikel 15 ","Het aantal kwalificatieplichtige jongeren dat een vrijstelling heeft gekregen vanwege bijzondere omstandigheden, waarbij is aangetoond dat de jongere op andere wijze voldoende onderwijs geniet.\n\n",{"$f":"CONCATENATE(\"Vul de aantallen in en ga uit van het laatst genoten onderwijs. Degenen die nog geen onderwijs volgden vallen onder 'geen onderwijs'. \nDe gemeente telt alle jongeren:\n- die op 1 augustus \", H1, \" in hun gemeente woonden én een vrijstelling hadden\n- waar de gemeente na die datum een vrijstelling voor heeft afgegeven voor schooljaar \",H1,\"-\",H2)","v":"Vul de aantallen in en ga uit van het laatst genoten onderwijs. Degenen die nog geen onderwijs volgden vallen onder 'geen onderwijs'. \nDe gemeente telt alle jongeren:\n- die op 1 augustus 2023 in hun gemeente woonden én een vrijstelling hadden\n- waar de gemeente na die datum een vrijstelling voor heeft afgegeven voor schooljaar 2023-2024"}]
["Absoluut verzuim","Absoluut verzuim totaal ","Het aantal leer- of kwalificatieplichtige jongeren dat absoluut verzuimer is (geweest) gedurende het schooljaar: de jongere is niet ingeschreven bij een onderwijsinstelling en beschikt niet over een vrijstelling.","Bij absoluut verzuim is een leerplichtige of kwalificatieplichtige jongere zonder vrijstelling niet ingeschreven bij een school of onderwijsinstelling. Een vrijstelling kan worden gegeven of kan ontstaan door rechtswege. Bij het invullen van de aantallen, ga uit van de laatst genoten onderwijssoort. Kijk daarbij naar het hele schooljaar (dus níét 1 peildatum) en tel alléén de specifieke personen mee (dus níét het aantal gevallen).\nHet gaat hier om:\n1. de groep potentiële ‘absoluut verzuimers’ van 5 tot en met 17 jaar die door BRP-ROD koppeling naar voren zijn gekomen, en\n2. waarop administratieve correcties zijn uitgevoerd. Tel niet de jongeren mee die naar voren zijn gekomen uit de koppeling BRP-ROD:\n- die een startkwalificatie hebben behaald\n- die zijn overleden in het schooljaar\n- die zijn verhuisd naar het buitenland\n- die zijn verhuisd naar een andere gemeente\n- die na verhuizing ingeschreven blijven op hun oude school\n- die al een vrijstelling hebben\n- die zijn ingeschreven in het niet bekostigd onderwijs (NBI)\n- die in het buitenland zijn ingeschreven\n- waarvan de inschrijving nog niet bekend was in leerplichtregistratie of niet was doorgegeven aan ROD\nNa deze correcties blijven de absoluut verzuimers over die nog teruggeleid moeten worden naar school."]
[null,"Langer dan 3 maanden","Het aantal leer- of kwalificatieplichtige jongeren zonder vrijstelling dat langer dan 3 maanden niet was ingeschreven op een school.\n\n","Vermeld bij de onderwijssoort waar de leerling het laatst ingeschreven was."]
[null,"Langer dan 4 aangesloten weken","Het aantal leer- of kwalificatieplichtige jongeren zonder vrijstelling dat langer dan 4 aaneengesloten weken niet was ingeschreven op een school.\n\n","Vermeld bij de onderwijssoort waar de leerling het laatst ingeschreven was."]
[null,"Weer ingeschreven","Het aantal jongeren met absoluut verzuim dat weer ingeschreven is in het onderwijs.\n\n","De gemeente geeft leerlingen maar 1 keer als absoluut verzuimer op. Ook al zijn de leerlingen 2 of meer keren absoluut verzuimer geweest en teruggeleid naar school. Vul de aantallen in en gebruik als uitgangspunt waar de leerling stond ingeschreven vóór de status als absoluut verzuimer.  "]
["Relatief verzuim","Relatief verzuim totaal","Het aantal leerlingen waarbij sprake is van meer dan 16 uur ongeoorloofd verzuim gedurende 4 opeenvolgende lesweken.","Het schoolhoofd is verplicht onwettig verzuim van een ingeschreven leerling te melden aan de leerplichtambtenaar. Dit is verzuim van meer dan 16 uren in 4 lesweken. Geef meerdere gevallen bij 1 leerling maar 1 keer op. Vul de aantallen in bij de onderwijssoort in waar de leerling ingeschreven staat. \nTel hierbij ook het luxe verzuim mee. Tel niet mee: signaalverzuim en beginnend verzuim als het minder dan 16 uur is in 4 weken.\n"]
[null,"Waarvan herhaald","Het aantal leerlingen waarbij sprake is van meerdere gevallen van ongeoorloofd verzuim van steeds meer dan 16 uur gedurende 4 opeenvolgende lesweken.\n\n","Het schoolhoofd is verplicht onwettig verzuim van een ingeschreven leerling te melden aan de leerplichtambtenaar. Dit is verzuim van meer dan 16 uren in 4 lesweken. Geef meerdere gevallen bij 1 leerling maar 1 keer op. Vul bij de onderwijssoort de aantallen in waar de leerling ingeschreven staat."]
{"$rows_left_out":12}
{"sheet":"Gemeente codes","index":3,"n_rows":344,"n_cols":3,"rows_kept":344,"cut":false,"hidden":true,"merged":[]}
["VolgNr","LAOV NUMMER","GEMEENTENAAM"]
[1,"deze regel leeg laten ivm keuzevak 1e blad Gemeentenaam"]
[2,"18478","Aa en Hunze"]
[3,"18181","Aalsmeer"]
[4,"18081","Aalten"]
[5,"18026","Achtkarspelen"]
[6,"18244","Alblasserdam"]
[7,"18316","Albrandswaard"]
[8,"18183","Alkmaar"]
[9,"18054","Almelo"]
[10,"18013","Almere"]
[11,"18246","Alphen aan den Rijn"]
[12,"18493","Alphen-Chaam"]
[13,"18551","Altena"]
[14,"18027","Ameland"]
[15,"18153","Amersfoort"]
[16,"18184","Amstelveen"]
[17,"18185","Amsterdam"]
[18,"18083","Apeldoorn"]
[19,"18084","Arnhem"]
{"$rows_left_out":325}
{"sheet":"Normen","index":4,"n_rows":24,"n_cols":12,"rows_kept":24,"cut":false,"hidden":true,"merged":[[16,1,20,1],[3,1,4,1],[5,1,8,1],[9,1,12,1],[9,2,10,2],[11,2,12,2],[13,1,15,1],[13,2,13,3]]}
[null,2023,{"$f":"B1+1","v":2024}]
[null,null,null,null,"speciaal basis-onderwijs",null,"(voortgezet) speciaal onderwijs",null,"voortgezet onderwijs",null,"middelbaar beroepsonderwijs"]
[null,null,null,null,"min","max","min","max","min","max","min","max"]
[null,"vervangende leerplicht","art. 3a"]
[null,null,"art. 3b"]
[null,"vrijstellingen","art. 5 onder a",null,0,0.01,0,0.04,0,0.01,0,0.01]
[null,null,"art. 5 onder b"]
[null,null,"art. 5 onder c",null,0,0.02,0,0.02,0,0.02,0,0.02]
[null,null,"art 15",null,0,0.01,0,0.02,0,0.01,0,0.02]
[null,"Ongeoorloofd verzuim","absoluut","totaal",0,0.02,0,0.02,0,0.02,0,0.02]
[null,null,null,"weer ingeschreven",0,0.02,0,0.02,0,0.02,0,0.02]
[null,null,"relatief","totaal",0,0.02,0,0.15,0.02,0.08,0.05,0.19]
[null,null,null,"waarvan luxe verzuim",0,0.02,0,0.02,0,0.02,0,0.02]
[null,"processen verbaal","absoluut verzuim",null,0,0.02,0,0.02,0,0.02,0,0.02]
[null,null,"relatief verzuim","totaal",0,0.01,0,0.05,0,0.02,0,0.02]
[null,null,null,"waarvan luxe verzuim",0,0.01,0,0.01,0,0.01,0,0.01]
[null,"thuiszitters","per 1 sept",null,0,0.01,0,0.01,0,0.01,0,0.01]
[null,null,"nieuwe gevallen"]
[null,null,"langer dan 6 maanden"]
[null,null,"opgelost",null,0,0.01,0,2.5000000000000001E-2,0,0.01,0,0.02]
{"$rows_left_out":5}
{"sheet":"Historie","index":5,"n_rows":1,"n_cols":3,"rows_kept":1,"cut":false,"hidden":true,"merged":[]}
["Datum","Gebruiker","Computer"]